Reaction Details
TargetC-C chemokine receptor type 1
LigandBDBM50401355
Substrate/Competitorn/a
Meas. Tech.ChEMBL_884039 (CHEMBL2215088)
EC50 12589.25±n/a nM
Citation Thiele, SMalmgaard-Clausen, MEngel-Andreasen, JSteen, ARummel, PCNielsen, MCGloriam, DEFrimurer, TMUlven, TRosenkilde, MM Modulation in selectivity and allosteric properties of small-molecule ligands for CC-chemokine receptors. J Med Chem55:8164-77 (2012) 
 
C-C chemokine receptor type 1
Name:C-C chemokine receptor type 1
Type:Enzyme
Mol. Mass.:41180.69
Organism:Homo sapiens (Human)
Description:P32246
Residue:355
BDBM50401355
NameBDBM50401355
Synonyms:CHEMBL2205806
TypeSmall organic molecule
Emp. Form.C12H12N2
Mol. Mass.184.2371
SMILESCc1cccc(n1)-c1cccc(C)n1