Reaction Details
TargetC-C chemokine receptor type 8
LigandBDBM50401357
Substrate/Competitorn/a
Meas. Tech.ChEMBL_884037 (CHEMBL2215086)
EC50 86000±n/a nM
Citation Thiele, SMalmgaard-Clausen, MEngel-Andreasen, JSteen, ARummel, PCNielsen, MCGloriam, DEFrimurer, TMUlven, TRosenkilde, MM Modulation in selectivity and allosteric properties of small-molecule ligands for CC-chemokine receptors. J Med Chem55:8164-77 (2012) 
 
C-C chemokine receptor type 8
Name:C-C chemokine receptor type 8
Type:PROTEIN
Mol. Mass.:40855.53
Organism:Homo sapiens (Human)
Description:ChEMBL_454278
Residue:355
BDBM50401357
NameBDBM50401357
Synonyms:CHEMBL1623498
TypeSmall organic molecule
Emp. Form.C12H8N2O2
Mol. Mass.212.2041
SMILESOc1ccnc2c1ccc1c(O)ccnc21