Reaction Details
TargetC-C chemokine receptor type 8
LigandBDBM50401351
Substrate/Competitorn/a
Meas. Tech.ChEMBL_884037 (CHEMBL2215086)
EC50 7500±n/a nM
Citation Thiele, SMalmgaard-Clausen, MEngel-Andreasen, JSteen, ARummel, PCNielsen, MCGloriam, DEFrimurer, TMUlven, TRosenkilde, MM Modulation in selectivity and allosteric properties of small-molecule ligands for CC-chemokine receptors. J Med Chem55:8164-77 (2012) 
 
C-C chemokine receptor type 8
Name:C-C chemokine receptor type 8
Type:PROTEIN
Mol. Mass.:40855.53
Organism:Homo sapiens (Human)
Description:ChEMBL_454278
Residue:355
BDBM50401351
NameBDBM50401351
Synonyms:CHEMBL2205807
TypeSmall organic molecule
Emp. Form.C12H12N2
Mol. Mass.184.2371
SMILESCc1ccc(nc1)-c1ccc(C)cn1