Reaction Details
TargetC-C chemokine receptor type 5
LigandBDBM64740
Substrate/Competitorn/a
Meas. Tech.ChEMBL_884030 (CHEMBL2215079)
IC50 30000±n/a nM
Citation Thiele, SMalmgaard-Clausen, MEngel-Andreasen, JSteen, ARummel, PCNielsen, MCGloriam, DEFrimurer, TMUlven, TRosenkilde, MM Modulation in selectivity and allosteric properties of small-molecule ligands for CC-chemokine receptors. J Med Chem55:8164-77 (2012) 
 
C-C chemokine receptor type 5
Name:C-C chemokine receptor type 5
Type:Enzyme
Mol. Mass.:40540.21
Organism:Homo sapiens (Human)
Description:P51681
Residue:352
BDBM64740
NameBDBM64740
Synonyms:2,9-dimethyl-1,10-phenanthroline SMR000555011 | cid_65237
TypeSmall organic molecule
Emp. Form.C14H12N2
Mol. Mass.208.2585
SMILESCc1ccc2ccc3ccc(C)nc3c2n1