Reaction Details
TargetC-C chemokine receptor type 5
LigandBDBM50401351
Substrate/Competitorn/a
Meas. Tech.ChEMBL_884030 (CHEMBL2215079)
IC50 206000±n/a nM
Citation Thiele, SMalmgaard-Clausen, MEngel-Andreasen, JSteen, ARummel, PCNielsen, MCGloriam, DEFrimurer, TMUlven, TRosenkilde, MM Modulation in selectivity and allosteric properties of small-molecule ligands for CC-chemokine receptors. J Med Chem55:8164-77 (2012) 
 
C-C chemokine receptor type 5
Name:C-C chemokine receptor type 5
Type:Enzyme
Mol. Mass.:40540.21
Organism:Homo sapiens (Human)
Description:P51681
Residue:352
BDBM50401351
NameBDBM50401351
Synonyms:CHEMBL2205807
TypeSmall organic molecule
Emp. Form.C12H12N2
Mol. Mass.184.2371
SMILESCc1ccc(nc1)-c1ccc(C)cn1