Reaction Details
TargetC-C chemokine receptor type 1
LigandBDBM50401347
Substrate/Competitorn/a
Meas. Tech.ChEMBL_884032 (CHEMBL2215081)
IC50 158489.32±n/a nM
Citation Thiele, SMalmgaard-Clausen, MEngel-Andreasen, JSteen, ARummel, PCNielsen, MCGloriam, DEFrimurer, TMUlven, TRosenkilde, MM Modulation in selectivity and allosteric properties of small-molecule ligands for CC-chemokine receptors. J Med Chem55:8164-77 (2012) 
 
C-C chemokine receptor type 1
Name:C-C chemokine receptor type 1
Type:Enzyme
Mol. Mass.:41180.69
Organism:Homo sapiens (Human)
Description:P32246
Residue:355
BDBM50401347
NameBDBM50401347
Synonyms:CHEMBL99384
TypeSmall organic molecule
Emp. Form.C16H16N2
Mol. Mass.236.3116
SMILESCc1cnc2c(ccc3c(C)c(C)cnc23)c1C