Reaction Details
TargetC-C chemokine receptor type 5
LigandBDBM50401340
Substrate/Competitorn/a
Meas. Tech.ChEMBL_884038 (CHEMBL2215087)
EC50>1000000±n/a nM
Citation Thiele, SMalmgaard-Clausen, MEngel-Andreasen, JSteen, ARummel, PCNielsen, MCGloriam, DEFrimurer, TMUlven, TRosenkilde, MM Modulation in selectivity and allosteric properties of small-molecule ligands for CC-chemokine receptors. J Med Chem55:8164-77 (2012) 
 
C-C chemokine receptor type 5
Name:C-C chemokine receptor type 5
Type:Enzyme
Mol. Mass.:40540.21
Organism:Homo sapiens (Human)
Description:P51681
Residue:352
BDBM50401340
NameBDBM50401340
Synonyms:CHEMBL1976682
TypeSmall organic molecule
Emp. Form.C14H10Br2N2
Mol. Mass.366.051
SMILESBrCc1ccc2ccc3ccc(CBr)nc3c2n1