Reaction Details
TargetC-C chemokine receptor type 5
LigandBDBM50401352
Substrate/Competitorn/a
Meas. Tech.ChEMBL_884038 (CHEMBL2215087)
EC50 2200±n/a nM
Citation Thiele, SMalmgaard-Clausen, MEngel-Andreasen, JSteen, ARummel, PCNielsen, MCGloriam, DEFrimurer, TMUlven, TRosenkilde, MM Modulation in selectivity and allosteric properties of small-molecule ligands for CC-chemokine receptors. J Med Chem55:8164-77 (2012) 
 
C-C chemokine receptor type 5
Name:C-C chemokine receptor type 5
Type:Enzyme
Mol. Mass.:40540.21
Organism:Homo sapiens (Human)
Description:P51681
Residue:352
BDBM50401352
NameBDBM50401352
Synonyms:CHEMBL2205810
TypeSmall organic molecule
Emp. Form.C13H10N2
Mol. Mass.194.2319
SMILESCc1cnc2c(ccc3cccnc23)c1