Reaction Details
TargetC-C chemokine receptor type 1
LigandBDBM50401346
Substrate/Competitorn/a
Meas. Tech.ChEMBL_884039 (CHEMBL2215088)
EC50 1000±n/a nM
Citation Thiele, SMalmgaard-Clausen, MEngel-Andreasen, JSteen, ARummel, PCNielsen, MCGloriam, DEFrimurer, TMUlven, TRosenkilde, MM Modulation in selectivity and allosteric properties of small-molecule ligands for CC-chemokine receptors. J Med Chem55:8164-77 (2012) 
 
C-C chemokine receptor type 1
Name:C-C chemokine receptor type 1
Type:Enzyme
Mol. Mass.:41180.69
Organism:Homo sapiens (Human)
Description:P32246
Residue:355
BDBM50401346
NameBDBM50401346
Synonyms:CHEMBL316589 | cid_93149
TypeSmall organic molecule
Emp. Form.C13H10N2
Mol. Mass.194.2319
SMILESCc1ccnc2c1ccc1cccnc21