Reaction Details
Target5-hydroxytryptamine receptor 7
LigandBDBM50401358
Substrate/Competitorn/a
Meas. Tech.ChEMBL_884088 (CHEMBL2215564)
Ki 2447±n/a nM
Citation Banister, SDManoli, MDoddareddy, MRHibbs, DEKassiou, M As(1) receptor pharmacophore derived from a series of N-substituted 4-azahexacyclo[5.4.1.0(2,6).0(3,10).0(5,9).0(8,11)]dodecan-3-ols (AHDs). Bioorg Med Chem Lett22:6053-8 (2012) 
 
5-hydroxytryptamine receptor 7
Name:5-hydroxytryptamine receptor 7
Type:G Protein-Coupled Receptor (GPCR)
Mol. Mass.:53573.08
Organism:Homo sapiens (Human)
Description:P34969
Residue:479
BDBM50401358
NameBDBM50401358
Synonyms:CHEMBL2205817
TypeSmall organic molecule
Emp. Form.C18H20N2O
Mol. Mass.280.3642
SMILESOC12C3C4C5C3C(C3C5CC4C13)N2CCc1cccnc1