Reaction Details
TargetHistamine H1 receptor
LigandBDBM50344630
Substrate/Competitorn/a
Meas. Tech.ChEMBL_884323 (CHEMBL2210356)
Ki 2372±n/a nM
Citation Banister, SDManoli, MDoddareddy, MRHibbs, DEKassiou, M As(1) receptor pharmacophore derived from a series of N-substituted 4-azahexacyclo[5.4.1.0(2,6).0(3,10).0(5,9).0(8,11)]dodecan-3-ols (AHDs). Bioorg Med Chem Lett22:6053-8 (2012) 
 
Histamine H1 receptor
Name:Histamine H1 receptor
Type:G Protein-Coupled Receptor (GPCR)
Mol. Mass.:55808.72
Organism:Homo sapiens (Human)
Description:Cell pellets from SK-N-MC cells transfected with human H1 receptor were used in binding assay.
Residue:487
BDBM50344630
NameBDBM50344630
Synonyms:CHEMBL1779058 | N-(4-(4-Fluoro)butyrophenone)-4-azahexacyclo[5.4.1.0(2,6).0(3,10).0(5,9).0(8,11)]dodecan-3-ol
TypeSmall organic molecule
Emp. Form.C21H22FNO2
Mol. Mass.339.4033
SMILESOC12C3C4C5C3C(C3C5CC4C13)N2CCCC(=O)c1ccc(F)cc1