Reaction Details
TargetD(2) dopamine receptor
LigandBDBM50401366
Substrate/Competitorn/a
Meas. Tech.ChEMBL_884319 (CHEMBL2210352)
Ki 2830±n/a nM
Citation Banister, SDManoli, MDoddareddy, MRHibbs, DEKassiou, M As(1) receptor pharmacophore derived from a series of N-substituted 4-azahexacyclo[5.4.1.0(2,6).0(3,10).0(5,9).0(8,11)]dodecan-3-ols (AHDs). Bioorg Med Chem Lett22:6053-8 (2012) 
 
D(2) dopamine receptor
Name:D(2) dopamine receptor
Type:Cell-surface receptors
Mol. Mass.:50647.10
Organism:Homo sapiens (Human)
Description:P14416
Residue:443
BDBM50401366
NameBDBM50401366
Synonyms:CHEMBL2205831
TypeSmall organic molecule
Emp. Form.C18H25NO
Mol. Mass.271.3972
SMILESOC12C3C4C5C3C(C3C5CC4C13)N2CC1CCCCC1