Reaction Details
TargetD(3) dopamine receptor
LigandBDBM50401368
Substrate/Competitorn/a
Meas. Tech.ChEMBL_884312 (CHEMBL2210345)
Ki 5466±n/a nM
Citation Banister, SDManoli, MDoddareddy, MRHibbs, DEKassiou, M As(1) receptor pharmacophore derived from a series of N-substituted 4-azahexacyclo[5.4.1.0(2,6).0(3,10).0(5,9).0(8,11)]dodecan-3-ols (AHDs). Bioorg Med Chem Lett22:6053-8 (2012) 
 
D(3) dopamine receptor
Name:D(3) dopamine receptor
Type:n/a
Mol. Mass.:44243.43
Organism:Homo sapiens (Human)
Description:n/a
Residue:400
BDBM50401368
NameBDBM50401368
Synonyms:CHEMBL2205813
TypeSmall organic molecule
Emp. Form.C21H25NO3
Mol. Mass.339.4281
SMILESCOc1cccc(CCN2C3C4C5C6C4C2(O)C2C6CC5C32)c1OC