Reaction Details
TargetAlpha-1B adrenergic receptor
LigandBDBM50401361
Substrate/Competitorn/a
Meas. Tech.ChEMBL_884055 (CHEMBL2215104)
Ki>10000±n/a nM
Citation Banister, SDManoli, MDoddareddy, MRHibbs, DEKassiou, M As(1) receptor pharmacophore derived from a series of N-substituted 4-azahexacyclo[5.4.1.0(2,6).0(3,10).0(5,9).0(8,11)]dodecan-3-ols (AHDs). Bioorg Med Chem Lett22:6053-8 (2012) 
 
Alpha-1B adrenergic receptor
Name:Alpha-1B adrenergic receptor
Type:Enzyme
Mol. Mass.:56862.13
Organism:Homo sapiens (Human)
Description:P35368
Residue:520
BDBM50401361
NameBDBM50401361
Synonyms:CHEMBL2205811
TypeSmall organic molecule
Emp. Form.C20H23NO2
Mol. Mass.309.4021
SMILESCOc1cccc(CCN2C3C4C5C6C4C2(O)C2C6CC5C32)c1