Reaction Details
TargetMu-type opioid receptor
LigandBDBM50401382
Substrate/Competitorn/a
Meas. Tech.ChEMBL_884080 (CHEMBL2215556)
Ki 2137±n/a nM
Citation Banister, SDManoli, MDoddareddy, MRHibbs, DEKassiou, M As(1) receptor pharmacophore derived from a series of N-substituted 4-azahexacyclo[5.4.1.0(2,6).0(3,10).0(5,9).0(8,11)]dodecan-3-ols (AHDs). Bioorg Med Chem Lett22:6053-8 (2012) 
 
Mu-type opioid receptor
Name:Mu-type opioid receptor
Type:G Protein-Coupled Receptor (GPCR)
Mol. Mass.:44789.51
Organism:Homo sapiens (Human)
Description:P35372
Residue:400
BDBM50401382
NameBDBM50401382
Synonyms:CHEMBL2205825
TypeSmall organic molecule
Emp. Form.C19H21NO2
Mol. Mass.295.3755
SMILESCOc1ccc(CN2C3C4C5C6C4C2(O)C2C6CC5C32)cc1