Reaction Details
TargetAlpha-1A adrenergic receptor
LigandBDBM50401383
Substrate/Competitorn/a
Meas. Tech.ChEMBL_884054 (CHEMBL2215103)
Ki>10000±n/a nM
Citation Banister, SDManoli, MDoddareddy, MRHibbs, DEKassiou, M As(1) receptor pharmacophore derived from a series of N-substituted 4-azahexacyclo[5.4.1.0(2,6).0(3,10).0(5,9).0(8,11)]dodecan-3-ols (AHDs). Bioorg Med Chem Lett22:6053-8 (2012) 
 
Alpha-1A adrenergic receptor
Name:Alpha-1A adrenergic receptor
Type:Cell-surface receptors
Mol. Mass.:51511.67
Organism:Homo sapiens (Human)
Description:P35348
Residue:466
BDBM50401383
NameBDBM50401383
Synonyms:CHEMBL2205824
TypeSmall organic molecule
Emp. Form.C19H21NO2
Mol. Mass.295.3755
SMILESCOc1cccc(CN2C3C4C5C6C4C2(O)C2C6CC5C32)c1