Reaction Details
TargetMuscarinic acetylcholine receptor M2
LigandBDBM50401384
Substrate/Competitorn/a
Meas. Tech.ChEMBL_884092 (CHEMBL2215568)
Ki 552±n/a nM
Citation Banister, SDManoli, MDoddareddy, MRHibbs, DEKassiou, M As(1) receptor pharmacophore derived from a series of N-substituted 4-azahexacyclo[5.4.1.0(2,6).0(3,10).0(5,9).0(8,11)]dodecan-3-ols (AHDs). Bioorg Med Chem Lett22:6053-8 (2012) 
 
Muscarinic acetylcholine receptor M2
Name:Muscarinic acetylcholine receptor M2
Type:GPCR
Mol. Mass.:51730.61
Organism:Homo sapiens (Human)
Description:P08172
Residue:466
BDBM50401384
NameBDBM50401384
Synonyms:CHEMBL2205823
TypeSmall organic molecule
Emp. Form.C19H21NO2
Mol. Mass.295.3755
SMILESCOc1ccccc1CN1C2C3C4C5C3C1(O)C1C5CC4C21