Reaction Details
TargetSodium-dependent serotonin transporter
LigandBDBM50401409
Substrate/Competitorn/a
Meas. Tech.ChEMBL_881850 (CHEMBL2211559)
Ki 122±n/a nM
Citation Mattsson, CAndreasson, TWaters, NSonesson, C Systematic in vivo screening of a series of 1-propyl-4-arylpiperidines against dopaminergic and serotonergic properties in rat brain: a scaffold-jumping approach. J Med Chem55:9735-50 (2012) 
 
Sodium-dependent serotonin transporter
Name:Sodium-dependent serotonin transporter
Type:Multi-pass membrane protein
Mol. Mass.:70322.51
Organism:Homo sapiens (Human)
Description:P31645
Residue:630
BDBM50401409
NameBDBM50401409
Synonyms:CHEMBL2207492
TypeSmall organic molecule
Emp. Form.C15H21N3
Mol. Mass.243.3473
SMILESCCCN1CCC(CC1)n1cnc2ccccc12