Reaction Details
TargetD(2) dopamine receptor
LigandBDBM50401403
Substrate/Competitorn/a
Meas. Tech.ChEMBL_881851 (CHEMBL2211560)
Ki 456±n/a nM
Citation Mattsson, CAndreasson, TWaters, NSonesson, C Systematic in vivo screening of a series of 1-propyl-4-arylpiperidines against dopaminergic and serotonergic properties in rat brain: a scaffold-jumping approach. J Med Chem55:9735-50 (2012) 
 
D(2) dopamine receptor
Name:D(2) dopamine receptor
Type:Cell-surface receptors
Mol. Mass.:50647.10
Organism:Homo sapiens (Human)
Description:P14416
Residue:443
BDBM50401403
NameBDBM50401403
Synonyms:CHEMBL2207493
TypeSmall organic molecule
Emp. Form.C15H20ClN3O
Mol. Mass.293.792
SMILESCCCN1CCC(CC1)n1c2ccc(Cl)cc2[nH]c1=O