Reaction Details
TargetD(2) dopamine receptor
LigandBDBM50401406
Substrate/Competitorn/a
Meas. Tech.ChEMBL_881852 (CHEMBL2211561)
Ki 112±n/a nM
Citation Mattsson, CAndreasson, TWaters, NSonesson, C Systematic in vivo screening of a series of 1-propyl-4-arylpiperidines against dopaminergic and serotonergic properties in rat brain: a scaffold-jumping approach. J Med Chem55:9735-50 (2012) 
 
D(2) dopamine receptor
Name:D(2) dopamine receptor
Type:Cell-surface receptors
Mol. Mass.:50647.10
Organism:Homo sapiens (Human)
Description:P14416
Residue:443
BDBM50401406
NameBDBM50401406
Synonyms:CHEMBL2207496
TypeSmall organic molecule
Emp. Form.C18H23N
Mol. Mass.253.3819
SMILESCCCN1CCC(CC1)c1cccc2ccccc12