Reaction Details
TargetD(2) dopamine receptor
LigandBDBM50401417
Substrate/Competitorn/a
Meas. Tech.ChEMBL_881852 (CHEMBL2211561)
Ki 27±n/a nM
Citation Mattsson, CAndreasson, TWaters, NSonesson, C Systematic in vivo screening of a series of 1-propyl-4-arylpiperidines against dopaminergic and serotonergic properties in rat brain: a scaffold-jumping approach. J Med Chem55:9735-50 (2012) 
 
D(2) dopamine receptor
Name:D(2) dopamine receptor
Type:Cell-surface receptors
Mol. Mass.:50647.10
Organism:Homo sapiens (Human)
Description:P14416
Residue:443
BDBM50401417
NameBDBM50401417
Synonyms:CHEMBL2207484
TypeSmall organic molecule
Emp. Form.C16H21FN2
Mol. Mass.260.3497
SMILESCCCN1CCC(CC1)c1c[nH]c2cc(F)ccc12