Reaction Details
TargetPhosphatidylinositol 4,5-bisphosphate 3-kinase catalytic subunit delta isoform
LigandBDBM50401471
Substrate/Competitorn/a
Meas. Tech.ChEMBL_883382 (CHEMBL2214581)
IC50 950±n/a nM
Citation Ihmaid, SKAl-Rawi, JMBradley, CJAngove, MJRobertson, MN Synthesis, DNA-PK inhibition, anti-platelet activity studies of 2-(N-substituted-3-aminopyridine)-substituted-1,3-benzoxazines and DNA-PK and PI3K inhibition, homology modelling studies of 2-morpholino-(7,8-di and 8-substituted)-1,3-benzoxazines. Eur J Med Chem57:85-101 (2012) 
 
Phosphatidylinositol 4,5-bisphosphate 3-kinase catalytic subunit delta isoform
Name:Phosphatidylinositol 4,5-bisphosphate 3-kinase catalytic subunit delta isoform
Type:Enzyme Subunit
Mol. Mass.:119489.41
Organism:Homo sapiens (Human)
Description:O00329
Residue:1044
BDBM50401471
NameBDBM50401471
Synonyms:CHEMBL243810
TypeSmall organic molecule
Emp. Form.C18H16N2O3
Mol. Mass.308.3312
SMILESO=c1nc(oc2c(cccc12)-c1ccccc1)N1CCOCC1