Reaction Details
TargetSerine/threonine-protein kinase Chk1
LigandBDBM50401634
Substrate/Competitorn/a
Meas. Tech.ChEMBL_887302 (CHEMBL2216281)
IC50 18±n/a nM
Citation Lainchbury, MMatthews, TPMcHardy, TBoxall, KJWalton, MIEve, PDHayes, AValenti, MRde Haven Brandon, AKBox, GAherne, GWReader, JCRaynaud, FIEccles, SAGarrett, MDCollins, I Discovery of 3-alkoxyamino-5-(pyridin-2-ylamino)pyrazine-2-carbonitriles as selective, orally bioavailable CHK1 inhibitors. J Med Chem55:10229-40 (2012) 
 
Serine/threonine-protein kinase Chk1
Name:Serine/threonine-protein kinase Chk1
Type:Enzyme Catalytic Domain
Mol. Mass.:54443.02
Organism:Homo sapiens (Human)
Description:gi_166295192
Residue:476
BDBM50401634
NameBDBM50401634
Synonyms:CHEMBL2203300
TypeSmall organic molecule
Emp. Form.C17H18N6O3S
Mol. Mass.386.428
SMILESCOC(=O)c1cnc(Nc2cnc(C#N)c(O[C@@H]3CCNC3)n2)cc1SC