Reaction Details
TargetPotassium voltage-gated channel subfamily A member 3
LigandBDBM50098785
Substrate/Competitorn/a
Meas. Tech.ChEMBL_884831 (CHEMBL2216585)
IC50 200±n/a nM
Citation Nguyen, WHoward, BLJenkins, DPWulff, HThompson, PEManallack, DT Structure-activity relationship exploration of Kv1.3 blockers based on diphenoxylate. Bioorg Med Chem Lett22:7106-9 (2012) 
 
Potassium voltage-gated channel subfamily A member 3
Name:Potassium voltage-gated channel subfamily A member 3
Type:PROTEIN
Mol. Mass.:63835.47
Organism:Homo sapiens (Human)
Description:ChEMBL_1513935
Residue:575
BDBM50098785
NameBDBM50098785
Synonyms:4-Benzhydryloxymethyl-1-[3-(4-methoxy-phenyl)-propyl]-piperidine UK-78282
TypeSmall organic molecule
Emp. Form.C29H35NO2
Mol. Mass.429.5937
SMILESCOc1ccc(CCCN2CCC(COC(c3ccccc3)c3ccccc3)CC2)cc1