Reaction Details
TargetHexokinase-4
LigandBDBM50401849
Substrate/Competitorn/a
Meas. Tech.ChEMBL_885380 (CHEMBL2215682)
EC50 350±n/a nM
Citation Pfefferkorn, JATu, MFilipski, KJGuzman-Perez, ABian, JAspnes, GESammons, MFSong, WLi, JCJones, CSPatel, LRasmusson, TZeng, DKarki, KHamilton, MHank, RAtkinson, KLitchfield, JAiello, RBaker, LBarucci, NBourassa, PBourbounais, FD'Aquila, TDerksen, DRMacDougall, MRobertson, A The design and synthesis of indazole and pyrazolopyridine based glucokinase activators for the treatment of type 2 diabetes mellitus. Bioorg Med Chem Lett22:7100-5 (2012) 
 
Hexokinase-4
Name:Hexokinase-4
Type:PROTEIN
Mol. Mass.:52101.81
Organism:Rattus norvegicus
Description:ChEMBL_1279785
Residue:465
BDBM50401849
NameBDBM50401849
Synonyms:CHEMBL2204663
TypeSmall organic molecule
Emp. Form.C24H22FN7O3
Mol. Mass.475.475
SMILESCCn1cc2c(Oc3cnc(C(=O)N4CCC4)c(F)c3)cc(cc2n1)C(=O)Nc1cnc(C)cn1