Reaction Details
TargetSigma non-opioid intracellular receptor 1
LigandBDBM50401861
Substrate/Competitorn/a
Meas. Tech.ChEMBL_886105 (CHEMBL2210027)
IC50 2.9±n/a nM
Citation Riganas, SPapanastasiou, IFoscolos, GBTsotinis, ASerin, GMirjolet, JFDimas, KKourafalos, VNEleutheriades, AMoutsos, VIKhan, HGeorgakopoulou, SZaniou, APrassa, MTheodoropoulou, MMantelas, APondiki, SVamvakides, A New adamantane phenylalkylamines withs-receptor binding affinity and anticancer activity, associated with putative antagonism of neuropathic pain. J Med Chem55:10241-61 (2012) 
 
Sigma non-opioid intracellular receptor 1
Name:Sigma non-opioid intracellular receptor 1
Type:Enzyme Catalytic Domain
Mol. Mass.:25124.85
Organism:Homo sapiens (Human)
Description:Q99720
Residue:223
BDBM50401861
NameBDBM50401861
Synonyms:CHEMBL2204672
TypeSmall organic molecule
Emp. Form.C30H40N2
Mol. Mass.428.652
SMILESCN1CCN(CCc2ccc(cc2)C(c2ccccc2)C23CC4CC(CC(C4)C2)C3)CC1