Reaction Details
TargetHistamine H3 receptor
LigandBDBM50401943
Substrate/Competitorn/a
Meas. Tech.ChEMBL_886474 (CHEMBL2214285)
Ki>10000±n/a nM
Citation Löber, SHübner, HBuschauer, ASanna, FArgiolas, AMelis, MRGmeiner, P Novel azulene derivatives for the treatment of erectile dysfunction. Bioorg Med Chem Lett22:7151-4 (2012) 
 
Histamine H3 receptor
Name:Histamine H3 receptor
Type:G Protein-Coupled Receptor (GPCR)
Mol. Mass.:48691.47
Organism:Homo sapiens (Human)
Description:Binding assays were using CHO cells stably expressing hH3R receptors.
Residue:445
BDBM50401943
NameBDBM50401943
Synonyms:CHEMBL2207642
TypeSmall organic molecule
Emp. Form.C33H37ClN4O
Mol. Mass.541.126
SMILESCOc1ccccc1N1CCN(Cc2cc(CN3CCN(CC3)c3ccc(Cl)cc3)c3cccccc23)CC1