Reaction Details
TargetHistamine H2 receptor
LigandBDBM50401943
Substrate/Competitorn/a
Meas. Tech.ChEMBL_886463 (CHEMBL2214274)
Ki 460±n/a nM
Citation Löber, SHübner, HBuschauer, ASanna, FArgiolas, AMelis, MRGmeiner, P Novel azulene derivatives for the treatment of erectile dysfunction. Bioorg Med Chem Lett22:7151-4 (2012) 
 
Histamine H2 receptor
Name:Histamine H2 receptor
Type:G Protein-Coupled Receptor (GPCR)
Mol. Mass.:40115.31
Organism:Homo sapiens (Human)
Description:n/a
Residue:359
BDBM50401943
NameBDBM50401943
Synonyms:CHEMBL2207642
TypeSmall organic molecule
Emp. Form.C33H37ClN4O
Mol. Mass.541.126
SMILESCOc1ccccc1N1CCN(Cc2cc(CN3CCN(CC3)c3ccc(Cl)cc3)c3cccccc23)CC1