Reaction Details
TargetD(1A) dopamine receptor
LigandBDBM50401950
Substrate/Competitorn/a
Meas. Tech.ChEMBL_886473 (CHEMBL2214284)
Ki 1400±n/a nM
Citation Löber, SHübner, HBuschauer, ASanna, FArgiolas, AMelis, MRGmeiner, P Novel azulene derivatives for the treatment of erectile dysfunction. Bioorg Med Chem Lett22:7151-4 (2012) 
 
D(1A) dopamine receptor
Name:D(1A) dopamine receptor
Type:PROTEIN
Mol. Mass.:49269.92
Organism:Sus scrofa
Description:ChEMBL_1460140
Residue:446
BDBM50401950
NameBDBM50401950
Synonyms:CHEMBL2207634
TypeSmall organic molecule
Emp. Form.C27H30N2O
Mol. Mass.398.5399
SMILESCCCC#Cc1cc(CN2CCN(CC2)c2ccccc2OC)c2cccccc12