Reaction Details
Target5-hydroxytryptamine receptor 2A
LigandBDBM50401946
Substrate/Competitorn/a
Meas. Tech.ChEMBL_886467 (CHEMBL2214278)
Ki 1000±n/a nM
Citation Löber, SHübner, HBuschauer, ASanna, FArgiolas, AMelis, MRGmeiner, P Novel azulene derivatives for the treatment of erectile dysfunction. Bioorg Med Chem Lett22:7151-4 (2012) 
 
5-hydroxytryptamine receptor 2A
Name:5-hydroxytryptamine receptor 2A
Type:Enzyme Catalytic Domain
Mol. Mass.:52679.13
Organism:PIG
Description:5-HT2 0 0::P50129
Residue:470
BDBM50401946
NameBDBM50401946
Synonyms:CHEMBL2207639
TypeSmall organic molecule
Emp. Form.C27H33N3O2
Mol. Mass.431.5698
SMILESCOc1ccccc1N1CCN(Cc2cc(CN3CCOCC3)c3cccccc23)CC1