Reaction Details
TargetD(3) dopamine receptor
LigandBDBM50401946
Substrate/Competitorn/a
Meas. Tech.ChEMBL_886470 (CHEMBL2214281)
Ki 350±n/a nM
Citation Löber, SHübner, HBuschauer, ASanna, FArgiolas, AMelis, MRGmeiner, P Novel azulene derivatives for the treatment of erectile dysfunction. Bioorg Med Chem Lett22:7151-4 (2012) 
 
D(3) dopamine receptor
Name:D(3) dopamine receptor
Type:n/a
Mol. Mass.:44243.43
Organism:Homo sapiens (Human)
Description:n/a
Residue:400
BDBM50401946
NameBDBM50401946
Synonyms:CHEMBL2207639
TypeSmall organic molecule
Emp. Form.C27H33N3O2
Mol. Mass.431.5698
SMILESCOc1ccccc1N1CCN(Cc2cc(CN3CCOCC3)c3cccccc23)CC1