Reaction Details
TargetD(2) dopamine receptor
LigandBDBM50401947
Substrate/Competitorn/a
Meas. Tech.ChEMBL_886471 (CHEMBL2214282)
Ki 37±n/a nM
Citation Löber, SHübner, HBuschauer, ASanna, FArgiolas, AMelis, MRGmeiner, P Novel azulene derivatives for the treatment of erectile dysfunction. Bioorg Med Chem Lett22:7151-4 (2012) 
 
D(2) dopamine receptor
Name:D(2) dopamine receptor
Type:Cell-surface receptors
Mol. Mass.:50647.10
Organism:Homo sapiens (Human)
Description:P14416
Residue:443
BDBM50401947
NameBDBM50401947
Synonyms:CHEMBL2207638
TypeSmall organic molecule
Emp. Form.C28H35N3O
Mol. Mass.429.597
SMILESCOc1ccccc1N1CCN(Cc2cc(CN3CCCCC3)c3cccccc23)CC1