Reaction Details
TargetD(2) dopamine receptor
LigandBDBM50401954
Substrate/Competitorn/a
Meas. Tech.ChEMBL_886471 (CHEMBL2214282)
Ki 39±n/a nM
Citation Löber, SHübner, HBuschauer, ASanna, FArgiolas, AMelis, MRGmeiner, P Novel azulene derivatives for the treatment of erectile dysfunction. Bioorg Med Chem Lett22:7151-4 (2012) 
 
D(2) dopamine receptor
Name:D(2) dopamine receptor
Type:Cell-surface receptors
Mol. Mass.:50647.10
Organism:Homo sapiens (Human)
Description:P14416
Residue:443
BDBM50401954
NameBDBM50401954
Synonyms:CHEMBL2207636
TypeSmall organic molecule
Emp. Form.C23H23N3O
Mol. Mass.357.4482
SMILESCOc1ccccc1N1CCN(Cc2cc(C#N)c3cccccc23)CC1