Reaction Details
TargetDelta-type opioid receptor
LigandBDBM50402018
Substrate/Competitorn/a
Meas. Tech.ChEMBL_886707 (CHEMBL2209607)
Ki 47.5±n/a nM
Citation Fujii, HImaide, SHirayama, SNemoto, TGouda, HHirono, SNagase, H Essential structure of opioid¿ receptor agonist nalfurafine for binding to the¿ receptor 3: synthesis of decahydro(iminoethano)phenanthrene derivatives with an oxygen functionality at the 3-position and their pharmacologies. Bioorg Med Chem Lett22:7711-4 (2012) 
 
Delta-type opioid receptor
Name:Delta-type opioid receptor
Type:Enzyme Catalytic Domain
Mol. Mass.:40577.25
Organism:MOUSE
Description:P32300
Residue:372
BDBM50402018
NameBDBM50402018
Synonyms:CHEMBL2204731
TypeSmall organic molecule
Emp. Form.C28H38N2O4
Mol. Mass.466.6123
SMILESCN([C@@H]1CC[C@@]2(O)[C@H]3CC4=C(C[C@H](O)CC4)[C@@]2(CCN3CC2CC2)C1)C(=O)\C=C\c1ccoc1