Reaction Details
TargetMu-type opioid receptor
LigandBDBM50402016
Substrate/Competitorn/a
Meas. Tech.ChEMBL_886708 (CHEMBL2209608)
Ki 34.7±n/a nM
Citation Fujii, HImaide, SHirayama, SNemoto, TGouda, HHirono, SNagase, H Essential structure of opioid¿ receptor agonist nalfurafine for binding to the¿ receptor 3: synthesis of decahydro(iminoethano)phenanthrene derivatives with an oxygen functionality at the 3-position and their pharmacologies. Bioorg Med Chem Lett22:7711-4 (2012) 
 
Mu-type opioid receptor
Name:Mu-type opioid receptor
Type:Enzyme Catalytic Domain
Mol. Mass.:44431.62
Organism:MOUSE
Description:OPIATE Mu OPRM1 MOUSE::P42866
Residue:398
BDBM50402016
NameBDBM50402016
Synonyms:CHEMBL2205413
TypeSmall organic molecule
Emp. Form.C28H38N2O4
Mol. Mass.466.6123
SMILESCN([C@@H]1CC[C@@]2(O)[C@H]3CC4=C(C[C@@H](O)CC4)[C@@]2(CCN3CC2CC2)C1)C(=O)\C=C\c1ccoc1