Reaction Details
TargetSerine/threonine-protein kinase PLK1
LigandBDBM50402022
Substrate/Competitorn/a
Meas. Tech.ChEMBL_886838 (CHEMBL2210942)
Ki 2000±n/a nM
Citation Zhang, QXia, ZMitten, MJLasko, LMKlinghofer, VBouska, JJohnson, EFPenning, TDLuo, YGiranda, VLShoemaker, ARStewart, KDDjuric, SWVasudevan, A Hit to Lead optimization of a novel class of squarate-containing polo-like kinases inhibitors. Bioorg Med Chem Lett22:7615-22 (2012) 
 
Serine/threonine-protein kinase PLK1
Name:Serine/threonine-protein kinase PLK1
Type:Serine/threonine-protein kinase
Mol. Mass.:68277.16
Organism:Homo sapiens (Human)
Description:P53350
Residue:603
BDBM50402022
NameBDBM50402022
Synonyms:CHEMBL549730
TypeSmall organic molecule
Emp. Form.C15H19N3O2
Mol. Mass.273.3303
SMILESCC(Nc1c(Nc2ccncc2)c(=O)c1=O)C(C)(C)C