Reaction Details
TargetSerine/threonine-protein kinase PLK1
LigandBDBM50402045
Substrate/Competitorn/a
Meas. Tech.ChEMBL_886837 (CHEMBL2210941)
EC50 1470±n/a nM
Citation Zhang, QXia, ZMitten, MJLasko, LMKlinghofer, VBouska, JJohnson, EFPenning, TDLuo, YGiranda, VLShoemaker, ARStewart, KDDjuric, SWVasudevan, A Hit to Lead optimization of a novel class of squarate-containing polo-like kinases inhibitors. Bioorg Med Chem Lett22:7615-22 (2012) 
 
Serine/threonine-protein kinase PLK1
Name:Serine/threonine-protein kinase PLK1
Type:Serine/threonine-protein kinase
Mol. Mass.:68277.16
Organism:Homo sapiens (Human)
Description:P53350
Residue:603
BDBM50402045
NameBDBM50402045
Synonyms:CHEMBL2205422
TypeSmall organic molecule
Emp. Form.C22H24N6O3
Mol. Mass.420.4644
SMILESCC(=O)N1CCc2cc(Nc3nccc(Nc4c(NC(C)(C)C)c(=O)c4=O)n3)ccc12