Reaction Details
TargetSerine/threonine-protein kinase PLK2
LigandBDBM50402020
Substrate/Competitorn/a
Meas. Tech.ChEMBL_886836 (CHEMBL2210940)
Ki 2±n/a nM
Citation Zhang, QXia, ZMitten, MJLasko, LMKlinghofer, VBouska, JJohnson, EFPenning, TDLuo, YGiranda, VLShoemaker, ARStewart, KDDjuric, SWVasudevan, A Hit to Lead optimization of a novel class of squarate-containing polo-like kinases inhibitors. Bioorg Med Chem Lett22:7615-22 (2012) 
 
Serine/threonine-protein kinase PLK2
Name:Serine/threonine-protein kinase PLK2
Type:Serine/threonine-protein kinase
Mol. Mass.:78259.87
Organism:Homo sapiens (Human)
Description:Full-length human PLK2 was expressed as GST-fusion protein using baculovirus expression system. GST-PLK2 was purified by using glutathione sepharose chromatography.
Residue:685
BDBM50402020
NameBDBM50402020
Synonyms:CHEMBL2205426
TypeSmall organic molecule
Emp. Form.C23H22N6O2
Mol. Mass.414.4598
SMILESCC(C)(C)Nc1c(Nc2ccnc(Nc3ccc(cc3)-c3ccncc3)n2)c(=O)c1=O