Reaction Details
TargetSerine/threonine-protein kinase PLK1
LigandBDBM50402033
Substrate/Competitorn/a
Meas. Tech.ChEMBL_886837 (CHEMBL2210941)
Ki 9930±n/a nM
Citation Zhang, QXia, ZMitten, MJLasko, LMKlinghofer, VBouska, JJohnson, EFPenning, TDLuo, YGiranda, VLShoemaker, ARStewart, KDDjuric, SWVasudevan, A Hit to Lead optimization of a novel class of squarate-containing polo-like kinases inhibitors. Bioorg Med Chem Lett22:7615-22 (2012) 
 
Serine/threonine-protein kinase PLK1
Name:Serine/threonine-protein kinase PLK1
Type:Serine/threonine-protein kinase
Mol. Mass.:68277.16
Organism:Homo sapiens (Human)
Description:P53350
Residue:603
BDBM50402033
NameBDBM50402033
Synonyms:CHEMBL2205441
TypeSmall organic molecule
Emp. Form.C22H27N5O2
Mol. Mass.393.4821
SMILESC[C@@H](Nc1nccc(Nc2c(N[C@H](C)C(C)(C)C)c(=O)c2=O)n1)c1ccccc1