Reaction Details
TargetSerine/threonine-protein kinase PLK1
LigandBDBM50402035
Substrate/Competitorn/a
Meas. Tech.ChEMBL_886837 (CHEMBL2210941)
Ki 8530±n/a nM
Citation Zhang, QXia, ZMitten, MJLasko, LMKlinghofer, VBouska, JJohnson, EFPenning, TDLuo, YGiranda, VLShoemaker, ARStewart, KDDjuric, SWVasudevan, A Hit to Lead optimization of a novel class of squarate-containing polo-like kinases inhibitors. Bioorg Med Chem Lett22:7615-22 (2012) 
 
Serine/threonine-protein kinase PLK1
Name:Serine/threonine-protein kinase PLK1
Type:Serine/threonine-protein kinase
Mol. Mass.:68277.16
Organism:Homo sapiens (Human)
Description:P53350
Residue:603
BDBM50402035
NameBDBM50402035
Synonyms:CHEMBL2205455
TypeSmall organic molecule
Emp. Form.C26H26N6O3
Mol. Mass.470.523
SMILESO=c1c(NCCN2CCOCC2)c(Nc2ccnc(Nc3ccc(cc3)-c3ccccc3)n2)c1=O