Reaction Details
TargetSerine/threonine-protein kinase MARK2
LigandBDBM50402020
Substrate/Competitorn/a
Meas. Tech.ChEMBL_886720 (CHEMBL2209620)
Ki 3610±n/a nM
Citation Zhang, QXia, ZMitten, MJLasko, LMKlinghofer, VBouska, JJohnson, EFPenning, TDLuo, YGiranda, VLShoemaker, ARStewart, KDDjuric, SWVasudevan, A Hit to Lead optimization of a novel class of squarate-containing polo-like kinases inhibitors. Bioorg Med Chem Lett22:7615-22 (2012) 
 
Serine/threonine-protein kinase MARK2
Name:Serine/threonine-protein kinase MARK2
Type:PROTEIN
Mol. Mass.:87953.09
Organism:Homo sapiens (Human)
Description:ChEMBL_774586
Residue:788
BDBM50402020
NameBDBM50402020
Synonyms:CHEMBL2205426
TypeSmall organic molecule
Emp. Form.C23H22N6O2
Mol. Mass.414.4598
SMILESCC(C)(C)Nc1c(Nc2ccnc(Nc3ccc(cc3)-c3ccncc3)n2)c(=O)c1=O