Reaction Details
TargetVascular endothelial growth factor receptor 2
LigandBDBM50402020
Substrate/Competitorn/a
Meas. Tech.ChEMBL_886742 (CHEMBL2210056)
Ki 98±n/a nM
Citation Zhang, QXia, ZMitten, MJLasko, LMKlinghofer, VBouska, JJohnson, EFPenning, TDLuo, YGiranda, VLShoemaker, ARStewart, KDDjuric, SWVasudevan, A Hit to Lead optimization of a novel class of squarate-containing polo-like kinases inhibitors. Bioorg Med Chem Lett22:7615-22 (2012) 
 
Vascular endothelial growth factor receptor 2
Name:Vascular endothelial growth factor receptor 2
Type:Receptor Tyrosine Kinase
Mol. Mass.:151510.97
Organism:Homo sapiens (Human)
Description:P35968
Residue:1356
BDBM50402020
NameBDBM50402020
Synonyms:CHEMBL2205426
TypeSmall organic molecule
Emp. Form.C23H22N6O2
Mol. Mass.414.4598
SMILESCC(C)(C)Nc1c(Nc2ccnc(Nc3ccc(cc3)-c3ccncc3)n2)c(=O)c1=O