Reaction Details
TargetReceptor-type tyrosine-protein kinase FLT3
LigandBDBM50402070
Substrate/Competitorn/a
Meas. Tech.ChEMBL_887122 (CHEMBL2214347)
IC50 17±n/a nM
Citation Amombo, GMKramer, TLo Monte, FGöring, SFach, MSmith, SKolb, SSchubenel, RBaumann, KSchmidt, B Modification of a promiscuous inhibitor shifts the inhibition from¿-secretase to FLT-3. Bioorg Med Chem Lett22:7634-40 (2012) 
 
Receptor-type tyrosine-protein kinase FLT3
Name:Receptor-type tyrosine-protein kinase FLT3
Type:Enzyme
Mol. Mass.:112888.62
Organism:Homo sapiens (Human)
Description:P36888
Residue:993
BDBM50402070
NameBDBM50402070
Synonyms:CHEMBL2206017
TypeSmall organic molecule
Emp. Form.C20H17ClN2O3
Mol. Mass.368.814
SMILESCOc1cc(\C=C2/C(=O)Nc3ccc(Cl)cc23)ccc1OCCCC#N