Reaction Details
TargetHistamine H1 receptor
LigandBDBM50402127
Substrate/Competitorn/a
Meas. Tech.ChEMBL_884700 (CHEMBL2215148)
Ki 19.95±n/a nM
Citation Furber, MAlcaraz, LLuckhurst, CBahl, ABeaton, HBowers, KCollington, JDenton, RDonald, DKinchin, EMacDonald, CRigby, ARiley, RSoars, MSpringthorpe, BWebborn, P Discovery and evolution of phenoxypiperidine hydroxyamide dual CCR3/H1 antagonists. Part II: optimising in vivo clearance. Bioorg Med Chem Lett22:7707-10 (2012) 
 
Histamine H1 receptor
Name:Histamine H1 receptor
Type:G Protein-Coupled Receptor (GPCR)
Mol. Mass.:55808.72
Organism:Homo sapiens (Human)
Description:Cell pellets from SK-N-MC cells transfected with human H1 receptor were used in binding assay.
Residue:487
BDBM50402127
NameBDBM50402127
Synonyms:CHEMBL2207671
TypeSmall organic molecule
Emp. Form.C25H27Cl2N3O6S
Mol. Mass.568.469
SMILESCS(=O)(=O)c1ccc2c(c[nH]c(=O)c2c1)C(=O)NC[C@@H](O)CN1CCC(CC1)Oc1ccc(Cl)c(Cl)c1