Reaction Details
TargetC-C chemokine receptor type 3
LigandBDBM50402135
Substrate/Competitorn/a
Meas. Tech.ChEMBL_884699 (CHEMBL2215147)
Ki 0.794±n/a nM
Citation Furber, MAlcaraz, LLuckhurst, CBahl, ABeaton, HBowers, KCollington, JDenton, RDonald, DKinchin, EMacDonald, CRigby, ARiley, RSoars, MSpringthorpe, BWebborn, P Discovery and evolution of phenoxypiperidine hydroxyamide dual CCR3/H1 antagonists. Part II: optimising in vivo clearance. Bioorg Med Chem Lett22:7707-10 (2012) 
 
C-C chemokine receptor type 3
Name:C-C chemokine receptor type 3
Type:Enzyme
Mol. Mass.:41053.88
Organism:Homo sapiens (Human)
Description:P51677
Residue:355
BDBM50402135
NameBDBM50402135
Synonyms:CHEMBL2207660
TypeSmall organic molecule
Emp. Form.C20H23Cl2F3N4O3
Mol. Mass.495.323
SMILESCc1c(Cl)ccc(OC2CCN(C[C@H](O)CNC(=O)c3cn[nH]c3C(F)(F)F)CC2)c1Cl