Reaction Details
TargetC-C chemokine receptor type 3
LigandBDBM50402110
Substrate/Competitorn/a
Meas. Tech.ChEMBL_884699 (CHEMBL2215147)
Ki 6.31±n/a nM
Citation Furber, MAlcaraz, LLuckhurst, CBahl, ABeaton, HBowers, KCollington, JDenton, RDonald, DKinchin, EMacDonald, CRigby, ARiley, RSoars, MSpringthorpe, BWebborn, P Discovery and evolution of phenoxypiperidine hydroxyamide dual CCR3/H1 antagonists. Part II: optimising in vivo clearance. Bioorg Med Chem Lett22:7707-10 (2012) 
 
C-C chemokine receptor type 3
Name:C-C chemokine receptor type 3
Type:Enzyme
Mol. Mass.:41053.88
Organism:Homo sapiens (Human)
Description:P51677
Residue:355
BDBM50402110
NameBDBM50402110
Synonyms:CHEMBL2207658
TypeSmall organic molecule
Emp. Form.C19H21Cl2F3N4O3
Mol. Mass.481.296
SMILESO[C@H](CNC(=O)c1cn[nH]c1C(F)(F)F)CN1CCC(CC1)Oc1ccc(Cl)c(Cl)c1