Reaction Details
TargetC-C chemokine receptor type 3
LigandBDBM50402116
Substrate/Competitorn/a
Meas. Tech.ChEMBL_884699 (CHEMBL2215147)
Ki 3.98±n/a nM
Citation Furber, MAlcaraz, LLuckhurst, CBahl, ABeaton, HBowers, KCollington, JDenton, RDonald, DKinchin, EMacDonald, CRigby, ARiley, RSoars, MSpringthorpe, BWebborn, P Discovery and evolution of phenoxypiperidine hydroxyamide dual CCR3/H1 antagonists. Part II: optimising in vivo clearance. Bioorg Med Chem Lett22:7707-10 (2012) 
 
C-C chemokine receptor type 3
Name:C-C chemokine receptor type 3
Type:Enzyme
Mol. Mass.:41053.88
Organism:Homo sapiens (Human)
Description:P51677
Residue:355
BDBM50402116
NameBDBM50402116
Synonyms:CHEMBL2207285
TypeSmall organic molecule
Emp. Form.C27H30Cl2N4O6S
Mol. Mass.609.521
SMILESO[C@H](CNC(=O)c1c[nH]c(=O)c2cc(ccc12)S(=O)(=O)NC1CC1)CN1CCC(CC1)Oc1ccc(Cl)c(Cl)c1