Reaction Details
TargetPotassium voltage-gated channel subfamily H member 2
LigandBDBM50402116
Substrate/Competitorn/a
Meas. Tech.ChEMBL_884698 (CHEMBL2215146)
IC50 794.33±n/a nM
Citation Furber, MAlcaraz, LLuckhurst, CBahl, ABeaton, HBowers, KCollington, JDenton, RDonald, DKinchin, EMacDonald, CRigby, ARiley, RSoars, MSpringthorpe, BWebborn, P Discovery and evolution of phenoxypiperidine hydroxyamide dual CCR3/H1 antagonists. Part II: optimising in vivo clearance. Bioorg Med Chem Lett22:7707-10 (2012) 
 
Potassium voltage-gated channel subfamily H member 2
Name:Potassium voltage-gated channel subfamily H member 2
Type:Multi-pass membrane protein
Mol. Mass.:126672.65
Organism:Homo sapiens (Human)
Description:Q12809
Residue:1159
BDBM50402116
NameBDBM50402116
Synonyms:CHEMBL2207285
TypeSmall organic molecule
Emp. Form.C27H30Cl2N4O6S
Mol. Mass.609.521
SMILESO[C@H](CNC(=O)c1c[nH]c(=O)c2cc(ccc12)S(=O)(=O)NC1CC1)CN1CCC(CC1)Oc1ccc(Cl)c(Cl)c1