Reaction Details
TargetHistamine H1 receptor
LigandBDBM50402108
Substrate/Competitorn/a
Meas. Tech.ChEMBL_884700 (CHEMBL2215148)
Ki 3.98±n/a nM
Citation Furber, MAlcaraz, LLuckhurst, CBahl, ABeaton, HBowers, KCollington, JDenton, RDonald, DKinchin, EMacDonald, CRigby, ARiley, RSoars, MSpringthorpe, BWebborn, P Discovery and evolution of phenoxypiperidine hydroxyamide dual CCR3/H1 antagonists. Part II: optimising in vivo clearance. Bioorg Med Chem Lett22:7707-10 (2012) 
 
Histamine H1 receptor
Name:Histamine H1 receptor
Type:G Protein-Coupled Receptor (GPCR)
Mol. Mass.:55808.72
Organism:Homo sapiens (Human)
Description:Cell pellets from SK-N-MC cells transfected with human H1 receptor were used in binding assay.
Residue:487
BDBM50402108
NameBDBM50402108
Synonyms:CHEMBL2207662
TypeSmall organic molecule
Emp. Form.C21H22Cl2F3N3O4
Mol. Mass.508.318
SMILESO[C@H](CNC(=O)c1c[nH]c(=O)cc1C(F)(F)F)CN1CCC(CC1)Oc1ccc(Cl)c(Cl)c1