Reaction Details
TargetHistamine H1 receptor
LigandBDBM50402135
Substrate/Competitorn/a
Meas. Tech.ChEMBL_884700 (CHEMBL2215148)
Ki 39.81±n/a nM
Citation Furber, MAlcaraz, LLuckhurst, CBahl, ABeaton, HBowers, KCollington, JDenton, RDonald, DKinchin, EMacDonald, CRigby, ARiley, RSoars, MSpringthorpe, BWebborn, P Discovery and evolution of phenoxypiperidine hydroxyamide dual CCR3/H1 antagonists. Part II: optimising in vivo clearance. Bioorg Med Chem Lett22:7707-10 (2012) 
 
Histamine H1 receptor
Name:Histamine H1 receptor
Type:G Protein-Coupled Receptor (GPCR)
Mol. Mass.:55808.72
Organism:Homo sapiens (Human)
Description:Cell pellets from SK-N-MC cells transfected with human H1 receptor were used in binding assay.
Residue:487
BDBM50402135
NameBDBM50402135
Synonyms:CHEMBL2207660
TypeSmall organic molecule
Emp. Form.C20H23Cl2F3N4O3
Mol. Mass.495.323
SMILESCc1c(Cl)ccc(OC2CCN(C[C@H](O)CNC(=O)c3cn[nH]c3C(F)(F)F)CC2)c1Cl